{"text_format":"1","workbook":"xlsx","n_sheets":8,"sheets":["(はじめにお読み下さい)申請書の使い方","申請書","申請額一覧","別添","個票1","職員表","口座情報","計算用"],"not_rendered":{"charts":0,"images":0,"macros":1,"external_links":0,"defined_names":9,"comments":6,"pivot_tables":0},"unopened":[],"bounds":{"document_bytes":16777216,"sheet_cells":100000,"rows_first":2000,"rows_last":500,"rows_between":2000,"halvings":0,"cell_chars":16384,"cell_head_chars":4096},"cells_cut":0,"cells_raw":0,"read":"whole","date_system":"1900"}

{"sheet":"(はじめにお読み下さい)申請書の使い方","index":0,"n_rows":17,"n_cols":4,"rows_kept":17,"cut":false,"hidden":false,"merged":[[1,0,1,3]]}
[]
["本申請書の使い方、申請の手順"]
[]
["手順","県の作業","事業者（法人本部）の作業","各事業所の作業"]
[1,"本Excelを管内の介護サービス事業者に配布"]
[{"$f":"A5+1","v":2},null,"本Excelを各事業所に配布し、以下の様式への記入を依頼。\n・様式２（個票）\n・様式３（職員票）\n※Excelファイルを開封した際は、｢コンテンツの有効化｣をクリック"]
[{"$f":"A6+1","v":3},null,null,"以下の作業を行った上で、事業者（法人本部）へ返送。\n【様式２（個票）】\n・水色セル：必要情報を入力\n・緑色セル：プルダウンから選択\n【様式３（職員票）】\n・当該事業所の従事者から、慰労金代理受領委任状を受領\n・当該委任状の提出のあった職員について、様式３に取りまとめ(青色及び緑色のセルに入力)"]
[4,null,"各事業所の個票のシートを１つのExcelファイルに集約し、個票シート名を「個票●」（●は１からの通し番号）に修正。"]
[5,null,"各事業所の様式３（職員表）を法人単位で一覧表として取りまとめ。\n兼務する複数の介護サービス事業所等から重複して申請している者がいないかを確認。\n※氏名（漢字、カナ）、生年月日が一致する者がいる場合、「重複申請者確認用」欄に「可」と表示されません。重複でないか確認し、確認出来たら「可」と入力ください\n※記入欄が不足する場合は、6行目～85行目を行ごとコピーし、86行目に右クリック→「コピーしたセルの挿入」で挿入。"]
[6,null,"様式２（個票）の内容が、別添（サービス別一覧）に正しく反映されていることを確認。\n※別添の記入欄が不足する場合は、6行目～20行目を行ごとコピーし、21行目に右クリック→「コピーしたセルの挿入」で挿入。"]
{"$rows_left_out":8}
{"sheet":"申請書","index":1,"n_rows":43,"n_cols":62,"rows_kept":43,"cut":false,"hidden":false,"merged":[[42,28,42,36],[41,20,42,22],[41,24,41,27],[42,24,42,27],[9,0,9,38],[39,20,39,26],[40,20,40,26],[39,28,39,36],[40,28,40,36],[41,28,41,36],[13,1,13,9],[13,10,13,17],[17,2,17,22],[38,28,38,36],[37,20,38,27],[37,29,37,32],[2,35,2,36],[2,32,2,33],[2,29,2,30],[18,2,18,22],[19,2,19,22],[16,2,16,22],[16,23,16,27],[17,23,17,27],[18,23,18,27],[19,23,19,27],[4,0,4,6],[6,17,6,36],[7,17,7,36],[17,47,17,48],[17,53,17,54],[18,47,18,48],[18,53,18,54],[17,59,17,60],[18,59,18,60]]}
["別記様式第１号（第７条関係）"]
[]
[null,null,null,null,null,null,null,null,null,null,null,null,null,null,null,null,null,null,null,null,null,null,null,null,null,null,null,null,"　　令和",null,null,"年",null,null,"月",null,null,"日"]
[]
["石川県知事",null,null,null,null,null,null,null,"殿"]
[]
[null,null,null,null,null,null,null,"（法人名）"]
[null,null,null,null,null,null,null,"（役職・代表者名）"]
[]
["令和２年度新型コロナウイルス感染症緊急包括支援交付金（介護分）に係る交付申請書"]
{"$rows_left_out":34}
{"sheet":"申請額一覧","index":2,"n_rows":104,"n_cols":22,"rows_kept":104,"cut":false,"hidden":false,"merged":[[2,0,3,0],[2,2,3,2],[2,1,3,1],[2,3,3,3],[2,4,3,4],[2,14,2,21],[2,5,3,5],[2,6,3,6],[2,7,2,12],[2,13,3,13]]}
["（様式１）事業所・施設別申請額一覧"]
[]
["No.","介護保険\n事業所番号","事業所・施設名","電話番号","郵便番号","住所","法人名","補助予定額（千円）",null,null,null,null,null,"審査\n結果","振込先口座"]
[null,null,null,null,null,null,null,"介護\n慰労金","20万円\n対象者の\n有無","感染対策\n費用助成\n事業","個別再開\n支援助成\n事業","再開環境\n整備助成\n事業","合計",null,"金融機関名","支店名\n（通帳記号）","金融機関コード","支店コード\n（店番）","分類","口座番号","口座名義（フリガナ）","口座名義"]
[{"$f":"ROW()-4","v":1},null,{"$f":"IFERROR(VLOOKUP($B5,別添!$B$5:$G$29,2,FALSE),\"\")","v":0},{"$f":"IFERROR(VLOOKUP($B5,別添!$B$5:$G$29,4,FALSE),\"\")","v":0},{"$f":"IFERROR(VLOOKUP($B5,別添!$B$5:$G$29,5,FALSE),\"\")","v":0},{"$f":"IFERROR(VLOOKUP($B5,別添!$B$5:$G$29,6,FALSE),\"\")","v":""},{"$f":"IF(M5>0,申請書!$R$7,\"\")","v":""},{"$f":"SUMIFS(別添!I$5:I$29,別添!$B$5:$B$29,$B5)","v":0},{"$f":"IFERROR(IF(COUNTIFS(別添!$B$5:$B$29,B5,別添!$J$5:$J$29,\"有\")>0,\"有\",\"\"),\"\")","v":""},{"$f":"SUMIFS(別添!K$5:K$29,別添!$B$5:$B$29,$B5)","v":0},{"$f":"SUMIFS(別添!L$5:L$29,別添!$B$5:$B$29,$B5)","v":0},{"$f":"SUMIFS(別添!M$5:M$29,別添!$B$5:$B$29,$B5)","v":0},{"$f":"SUM(H5,J5,K5,L5)","v":0},null,{"$f":"IF(口座情報!AQ5=1,口座情報!E5,IF(口座情報!AR5=1,\"ゆうちょ銀行\",\"\"))","v":""},{"$f":"IF(口座情報!AQ5=1,口座情報!J5,IF(口座情報!AR5=1,口座情報!AA5&口座情報!AB5&口座情報!AC5&口座情報!AD5&口座情報!AE5&口座情報!AF5,\"\"))","v":""},{"$f":"IF(口座情報!AQ5=1,口座情報!F5&口座情報!G5&口座情報!H5&口座情報!I5,\"\")","v":""},{"$f":"IF(口座情報!AQ5=1,口座情報!K5&口座情報!L5&口座情報!M5,IF(口座情報!AR5=1,口座情報!X5&口座情報!Y5&口座情報!Z5,\"\"))","v":""},{"$f":"IF(口座情報!AQ5=1,口座情報!N5,\"\")","v":""},{"$f":"IF(口座情報!AQ5=1,口座情報!O5&口座情報!P5&口座情報!Q5&口座情報!R5&口座情報!S5&口座情報!T5&口座情報!U5,IF(口座情報!AR5=1,口座情報!AG5&口座情報!AH5&口座情報!AI5&口座情報!AJ5&口座情報!AK5&口座情報!AL5&口座情報!AM5&口座情報!AN5,\"\"))","v":""},{"$f":"IF(口座情報!AQ5=1,口座情報!V5,IF(口座情報!AR5=1,口座情報!AO5,\"\"))","v":""},{"$f":"IF(口座情報!AQ5=1,口座情報!W5,IF(口座情報!AR5=1,口座情報!AP5,\"\"))","v":""}]
[{"$f":"ROW()-4","v":2},"",{"$f":"IFERROR(VLOOKUP($B6,別添!$B$5:$G$29,2,FALSE),\"\")","v":""},{"$f":"IFERROR(VLOOKUP($B6,別添!$B$5:$G$29,4,FALSE),\"\")","v":""},{"$f":"IFERROR(VLOOKUP($B6,別添!$B$5:$G$29,5,FALSE),\"\")","v":""},{"$f":"IFERROR(VLOOKUP($B6,別添!$B$5:$G$29,6,FALSE),\"\")","v":""},{"$f":"IF(M6>0,申請書!$R$7,\"\")","v":""},{"$f":"SUMIFS(別添!I$5:I$29,別添!$B$5:$B$29,$B6)","v":0},{"$f":"IFERROR(IF(COUNTIFS(別添!$B$5:$B$29,B6,別添!$J$5:$J$29,\"有\")>0,\"有\",\"\"),\"\")","v":""},{"$f":"SUMIFS(別添!K$5:K$29,別添!$B$5:$B$29,$B6)","v":0},{"$f":"SUMIFS(別添!L$5:L$29,別添!$B$5:$B$29,$B6)","v":0},{"$f":"SUMIFS(別添!M$5:M$29,別添!$B$5:$B$29,$B6)","v":0},{"$f":"SUM(H6,J6,K6,L6)","v":0},null,{"$f":"IF(口座情報!AQ6=1,口座情報!E6,IF(口座情報!AR6=1,\"ゆうちょ銀行\",\"\"))","v":""},{"$f":"IF(口座情報!AQ6=1,口座情報!J6,IF(口座情報!AR6=1,口座情報!AA6&口座情報!AB6&口座情報!AC6&口座情報!AD6&口座情報!AE6&口座情報!AF6,\"\"))","v":""},{"$f":"IF(口座情報!AQ6=1,口座情報!F6&口座情報!G6&口座情報!H6&口座情報!I6,\"\")","v":""},{"$f":"IF(口座情報!AQ6=1,口座情報!K6&口座情報!L6&口座情報!M6,IF(口座情報!AR6=1,口座情報!X6&口座情報!Y6&口座情報!Z6,\"\"))","v":""},{"$f":"IF(口座情報!AQ6=1,口座情報!N6,\"\")","v":""},{"$f":"IF(口座情報!AQ6=1,口座情報!O6&口座情報!P6&口座情報!Q6&口座情報!R6&口座情報!S6&口座情報!T6&口座情報!U6,IF(口座情報!AR6=1,口座情報!AG6&口座情報!AH6&口座情報!AI6&口座情報!AJ6&口座情報!AK6&口座情報!AL6&口座情報!AM6&口座情報!AN6,\"\"))","v":""},{"$f":"IF(口座情報!AQ6=1,口座情報!V6,IF(口座情報!AR6=1,口座情報!AO6,\"\"))","v":""},{"$f":"IF(口座情報!AQ6=1,口座情報!W6,IF(口座情報!AR6=1,口座情報!AP6,\"\"))","v":""}]
[3,null,{"$f":"IFERROR(VLOOKUP($B7,別添!$B$5:$G$29,2,FALSE),\"\")","v":0},{"$f":"IFERROR(VLOOKUP($B7,別添!$B$5:$G$29,4,FALSE),\"\")","v":0},{"$f":"IFERROR(VLOOKUP($B7,別添!$B$5:$G$29,5,FALSE),\"\")","v":0},{"$f":"IFERROR(VLOOKUP($B7,別添!$B$5:$G$29,6,FALSE),\"\")","v":""},{"$f":"IF(M7>0,申請書!$R$7,\"\")","v":""},{"$f":"SUMIFS(別添!I$5:I$29,別添!$B$5:$B$29,$B7)","v":0},{"$f":"IFERROR(IF(COUNTIFS(別添!$B$5:$B$29,B7,別添!$J$5:$J$29,\"有\")>0,\"有\",\"\"),\"\")","v":""},{"$f":"SUMIFS(別添!K$5:K$29,別添!$B$5:$B$29,$B7)","v":0},{"$f":"SUMIFS(別添!L$5:L$29,別添!$B$5:$B$29,$B7)","v":0},{"$f":"SUMIFS(別添!M$5:M$29,別添!$B$5:$B$29,$B7)","v":0},0,null,{"$f":"IF(口座情報!AQ7=1,口座情報!E7,IF(口座情報!AR7=1,\"ゆうちょ銀行\",\"\"))","v":""},{"$f":"IF(口座情報!AQ7=1,口座情報!J7,IF(口座情報!AR7=1,口座情報!AA7&口座情報!AB7&口座情報!AC7&口座情報!AD7&口座情報!AE7&口座情報!AF7,\"\"))","v":""},{"$f":"IF(口座情報!AQ7=1,口座情報!F7&口座情報!G7&口座情報!H7&口座情報!I7,\"\")","v":""},{"$f":"IF(口座情報!AQ7=1,口座情報!K7&口座情報!L7&口座情報!M7,IF(口座情報!AR7=1,口座情報!X7&口座情報!Y7&口座情報!Z7,\"\"))","v":""},{"$f":"IF(口座情報!AQ7=1,口座情報!N7,\"\")","v":""},{"$f":"IF(口座情報!AQ7=1,口座情報!O7&口座情報!P7&口座情報!Q7&口座情報!R7&口座情報!S7&口座情報!T7&口座情報!U7,IF(口座情報!AR7=1,口座情報!AG7&口座情報!AH7&口座情報!AI7&口座情報!AJ7&口座情報!AK7&口座情報!AL7&口座情報!AM7&口座情報!AN7,\"\"))","v":""},{"$f":"IF(口座情報!AQ7=1,口座情報!V7,IF(口座情報!AR7=1,口座情報!AO7,\"\"))","v":""},{"$f":"IF(口座情報!AQ7=1,口座情報!W7,IF(口座情報!AR7=1,口座情報!AP7,\"\"))","v":""}]
[4,null,{"$f":"IFERROR(VLOOKUP($B8,別添!$B$5:$G$29,2,FALSE),\"\")","v":0},{"$f":"IFERROR(VLOOKUP($B8,別添!$B$5:$G$29,4,FALSE),\"\")","v":0},{"$f":"IFERROR(VLOOKUP($B8,別添!$B$5:$G$29,5,FALSE),\"\")","v":0},{"$f":"IFERROR(VLOOKUP($B8,別添!$B$5:$G$29,6,FALSE),\"\")","v":""},{"$f":"IF(M8>0,申請書!$R$7,\"\")","v":""},{"$f":"SUMIFS(別添!I$5:I$29,別添!$B$5:$B$29,$B8)","v":0},{"$f":"IFERROR(IF(COUNTIFS(別添!$B$5:$B$29,B8,別添!$J$5:$J$29,\"有\")>0,\"有\",\"\"),\"\")","v":""},{"$f":"SUMIFS(別添!K$5:K$29,別添!$B$5:$B$29,$B8)","v":0},{"$f":"SUMIFS(別添!L$5:L$29,別添!$B$5:$B$29,$B8)","v":0},{"$f":"SUMIFS(別添!M$5:M$29,別添!$B$5:$B$29,$B8)","v":0},0,null,{"$f":"IF(口座情報!AQ8=1,口座情報!E8,IF(口座情報!AR8=1,\"ゆうちょ銀行\",\"\"))","v":""},{"$f":"IF(口座情報!AQ8=1,口座情報!J8,IF(口座情報!AR8=1,口座情報!AA8&口座情報!AB8&口座情報!AC8&口座情報!AD8&口座情報!AE8&口座情報!AF8,\"\"))","v":""},{"$f":"IF(口座情報!AQ8=1,口座情報!F8&口座情報!G8&口座情報!H8&口座情報!I8,\"\")","v":""},{"$f":"IF(口座情報!AQ8=1,口座情報!K8&口座情報!L8&口座情報!M8,IF(口座情報!AR8=1,口座情報!X8&口座情報!Y8&口座情報!Z8,\"\"))","v":""},{"$f":"IF(口座情報!AQ8=1,口座情報!N8,\"\")","v":""},{"$f":"IF(口座情報!AQ8=1,口座情報!O8&口座情報!P8&口座情報!Q8&口座情報!R8&口座情報!S8&口座情報!T8&口座情報!U8,IF(口座情報!AR8=1,口座情報!AG8&口座情報!AH8&口座情報!AI8&口座情報!AJ8&口座情報!AK8&口座情報!AL8&口座情報!AM8&口座情報!AN8,\"\"))","v":""},{"$f":"IF(口座情報!AQ8=1,口座情報!V8,IF(口座情報!AR8=1,口座情報!AO8,\"\"))","v":""},{"$f":"IF(口座情報!AQ8=1,口座情報!W8,IF(口座情報!AR8=1,口座情報!AP8,\"\"))","v":""}]
[5,null,{"$f":"IFERROR(VLOOKUP($B9,別添!$B$5:$G$29,2,FALSE),\"\")","v":0},{"$f":"IFERROR(VLOOKUP($B9,別添!$B$5:$G$29,4,FALSE),\"\")","v":0},{"$f":"IFERROR(VLOOKUP($B9,別添!$B$5:$G$29,5,FALSE),\"\")","v":0},{"$f":"IFERROR(VLOOKUP($B9,別添!$B$5:$G$29,6,FALSE),\"\")","v":""},{"$f":"IF(M9>0,申請書!$R$7,\"\")","v":""},{"$f":"SUMIFS(別添!I$5:I$29,別添!$B$5:$B$29,$B9)","v":0},{"$f":"IFERROR(IF(COUNTIFS(別添!$B$5:$B$29,B9,別添!$J$5:$J$29,\"有\")>0,\"有\",\"\"),\"\")","v":""},{"$f":"SUMIFS(別添!K$5:K$29,別添!$B$5:$B$29,$B9)","v":0},{"$f":"SUMIFS(別添!L$5:L$29,別添!$B$5:$B$29,$B9)","v":0},{"$f":"SUMIFS(別添!M$5:M$29,別添!$B$5:$B$29,$B9)","v":0},0,null,{"$f":"IF(口座情報!AQ9=1,口座情報!E9,IF(口座情報!AR9=1,\"ゆうちょ銀行\",\"\"))","v":""},{"$f":"IF(口座情報!AQ9=1,口座情報!J9,IF(口座情報!AR9=1,口座情報!AA9&口座情報!AB9&口座情報!AC9&口座情報!AD9&口座情報!AE9&口座情報!AF9,\"\"))","v":""},{"$f":"IF(口座情報!AQ9=1,口座情報!F9&口座情報!G9&口座情報!H9&口座情報!I9,\"\")","v":""},{"$f":"IF(口座情報!AQ9=1,口座情報!K9&口座情報!L9&口座情報!M9,IF(口座情報!AR9=1,口座情報!X9&口座情報!Y9&口座情報!Z9,\"\"))","v":""},{"$f":"IF(口座情報!AQ9=1,口座情報!N9,\"\")","v":""},{"$f":"IF(口座情報!AQ9=1,口座情報!O9&口座情報!P9&口座情報!Q9&口座情報!R9&口座情報!S9&口座情報!T9&口座情報!U9,IF(口座情報!AR9=1,口座情報!AG9&口座情報!AH9&口座情報!AI9&口座情報!AJ9&口座情報!AK9&口座情報!AL9&口座情報!AM9&口座情報!AN9,\"\"))","v":""},{"$f":"IF(口座情報!AQ9=1,口座情報!V9,IF(口座情報!AR9=1,口座情報!AO9,\"\"))","v":""},{"$f":"IF(口座情報!AQ9=1,口座情報!W9,IF(口座情報!AR9=1,口座情報!AP9,\"\"))","v":""}]
[6,null,{"$f":"IFERROR(VLOOKUP($B10,別添!$B$5:$G$29,2,FALSE),\"\")","v":0},{"$f":"IFERROR(VLOOKUP($B10,別添!$B$5:$G$29,4,FALSE),\"\")","v":0},{"$f":"IFERROR(VLOOKUP($B10,別添!$B$5:$G$29,5,FALSE),\"\")","v":0},{"$f":"IFERROR(VLOOKUP($B10,別添!$B$5:$G$29,6,FALSE),\"\")","v":""},{"$f":"IF(M10>0,申請書!$R$7,\"\")","v":""},{"$f":"SUMIFS(別添!I$5:I$29,別添!$B$5:$B$29,$B10)","v":0},{"$f":"IFERROR(IF(COUNTIFS(別添!$B$5:$B$29,B10,別添!$J$5:$J$29,\"有\")>0,\"有\",\"\"),\"\")","v":""},{"$f":"SUMIFS(別添!K$5:K$29,別添!$B$5:$B$29,$B10)","v":0},{"$f":"SUMIFS(別添!L$5:L$29,別添!$B$5:$B$29,$B10)","v":0},{"$f":"SUMIFS(別添!M$5:M$29,別添!$B$5:$B$29,$B10)","v":0},0,null,{"$f":"IF(口座情報!AQ10=1,口座情報!E10,IF(口座情報!AR10=1,\"ゆうちょ銀行\",\"\"))","v":""},{"$f":"IF(口座情報!AQ10=1,口座情報!J10,IF(口座情報!AR10=1,口座情報!AA10&口座情報!AB10&口座情報!AC10&口座情報!AD10&口座情報!AE10&口座情報!AF10,\"\"))","v":""},{"$f":"IF(口座情報!AQ10=1,口座情報!F10&口座情報!G10&口座情報!H10&口座情報!I10,\"\")","v":""},{"$f":"IF(口座情報!AQ10=1,口座情報!K10&口座情報!L10&口座情報!M10,IF(口座情報!AR10=1,口座情報!X10&口座情報!Y10&口座情報!Z10,\"\"))","v":""},{"$f":"IF(口座情報!AQ10=1,口座情報!N10,\"\")","v":""},{"$f":"IF(口座情報!AQ10=1,口座情報!O10&口座情報!P10&口座情報!Q10&口座情報!R10&口座情報!S10&口座情報!T10&口座情報!U10,IF(口座情報!AR10=1,口座情報!AG10&口座情報!AH10&口座情報!AI10&口座情報!AJ10&口座情報!AK10&口座情報!AL10&口座情報!AM10&口座情報!AN10,\"\"))","v":""},{"$f":"IF(口座情報!AQ10=1,口座情報!V10,IF(口座情報!AR10=1,口座情報!AO10,\"\"))","v":""},{"$f":"IF(口座情報!AQ10=1,口座情報!W10,IF(口座情報!AR10=1,口座情報!AP10,\"\"))","v":""}]
{"$rows_left_out":95}
{"sheet":"別添","index":3,"n_rows":32,"n_cols":40,"rows_kept":32,"cut":false,"hidden":false,"merged":[[2,4,3,4],[2,8,2,13],[2,0,3,0],[2,1,3,1],[2,2,3,2],[2,3,3,3],[2,7,3,7],[2,6,3,6],[2,5,3,5]]}
["（別添）事業所・施設別申請額一覧（サービス別一覧）"]
[]
["No.","介護保険\n事業所番号","事業所・施設名","サービス種別","電話番号","郵便番号","住所","法人名","補助予定額（千円）"]
[null,null,null,null,null,null,null,null,"介護\n慰労金","20万円\n対象者の\n有無","感染対策\n費用助成\n事業","個別再開\n支援助成\n事業","再開環境\n整備助成\n事業","合計"]
[{"$f":"ROW()-4","v":1},{"$f":"IFERROR(INDIRECT(\"個票\"&$A5&\"！$h$7\"),\"\")","v":0},{"$f":"IFERROR(INDIRECT(\"個票\"&$A5&\"！$t$7\"),\"\")","v":0},{"$f":"IFERROR(INDIRECT(\"個票\"&$A5&\"！$h$10\"),\"\")","v":0},{"$f":"IFERROR(INDIRECT(\"個票\"&$A5&\"！$AC$9\"),\"\")","v":0},{"$f":"IFERROR(INDIRECT(\"個票\"&$A5&\"！$d$9\"),\"\")","v":0},{"$f":"IFERROR(INDIRECT(\"個票\"&$A5&\"！$H$9\")&INDIRECT(\"個票\"&$A5&\"！$L$9\"),\"\")","v":""},{"$f":"IF(N5>0,申請書!$R$7,\"\")","v":""},{"$f":"IFERROR(INDIRECT(\"個票\"&$A5&\"！$ai$21\"),\"\")","v":0},{"$f":"IFERROR(INDIRECT(\"個票\"&$A5&\"！$ao$22\"),\"\")","v":0},{"$f":"IFERROR(INDIRECT(\"個票\"&$A5&\"！$ai$24\"),\"\")","v":0},{"$f":"IFERROR(INDIRECT(\"個票\"&$A5&\"！$ai$39\"),\"\")","v":0},{"$f":"IFERROR(INDIRECT(\"個票\"&$A5&\"！$ai$47\"),\"\")","v":0},{"$f":"SUM(I5,K5,L5,M5)","v":0},null,null,{"$f":"IF(_xlfn.SHEETS()-7=COUNTIF(N5:N32,\">0\"),\"○\",\"！（本表の事業所数と個票の枚数が一致しません）\")","v":"！（本表の事業所数と個票の枚数が一致しません）"},null,null,null,null,null,null,null,null,null,null,null,null,null,null,null,null,null,null,null,null,null,{"$f":"IFERROR(INDIRECT(\"個票\"&$A5&\"！$m$22\"),\"\")","v":0},{"$f":"IFERROR(INDIRECT(\"個票\"&$A5&\"！$v$22\"),\"\")","v":0}]
[{"$f":"ROW()-4","v":2},{"$f":"IFERROR(INDIRECT(\"個票\"&$A6&\"！$h$7\"),\"\")","v":""},"","","","","",{"$f":"IF(N6>0,申請書!$R$7,\"\")","v":""},"","","","",{"$f":"IFERROR(INDIRECT(\"個票\"&$A6&\"！$ai$47\"),\"\")","v":""},0,null,null,null,null,null,null,null,null,null,null,null,null,null,null,null,null,null,null,null,null,null,null,null,null,{"$f":"IFERROR(INDIRECT(\"個票\"&$A6&\"！$m$22\"),\"\")","v":""},{"$f":"IFERROR(INDIRECT(\"個票\"&$A6&\"！$v$22\"),\"\")","v":""}]
[3,"","","","","","",{"$f":"IF(N7>0,申請書!$R$7,\"\")","v":""},"","","","",{"$f":"IFERROR(INDIRECT(\"個票\"&$A7&\"！$ai$47\"),\"\")","v":""},0,null,null,null,null,null,null,null,null,null,null,null,null,null,null,null,null,null,null,null,null,null,null,null,null,"",""]
[4,"","","","","","",{"$f":"IF(N8>0,申請書!$R$7,\"\")","v":""},"","","","","",0,null,null,null,null,null,null,null,null,null,null,null,null,null,null,null,null,null,null,null,null,null,null,null,null,"",""]
[5,"","","","","","",{"$f":"IF(N9>0,申請書!$R$7,\"\")","v":""},"","","","","",0,null,null,null,null,null,null,null,null,null,null,null,null,null,null,null,null,null,null,null,null,null,null,null,null,"",""]
[6,"","","","","","",{"$f":"IF(N10>0,申請書!$R$7,\"\")","v":""},"","","","","",0,null,null,null,null,null,null,null,null,null,null,null,null,null,null,null,null,null,null,null,null,null,null,null,null,"",""]
{"$rows_left_out":23}
{"sheet":"個票1","index":4,"n_rows":62,"n_cols":84,"rows_kept":62,"cut":false,"hidden":false,"merged":[[9,17,9,22],[9,7,9,16],[38,30,38,33],[44,34,44,36],[44,37,44,38],[39,37,39,38],[34,12,34,38],[35,7,35,11],[35,12,35,38],[36,12,36,38],[28,12,28,38],[29,12,29,38],[30,12,30,38],[36,7,36,11],[31,7,31,11],[32,7,32,11],[34,7,34,11],[33,7,33,11],[31,12,31,38],[32,12,32,38],[33,12,33,38],[28,7,28,11],[29,7,29,11],[30,7,30,11],[38,34,38,36],[38,37,38,38],[16,23,16,25],[18,0,18,38],[26,0,26,6],[27,12,27,38],[26,12,26,38],[27,7,27,11],[15,26,15,38],[24,37,24,38],[25,34,25,36],[25,37,25,38],[26,7,26,11],[21,30,21,32],[24,34,24,36],[20,30,20,33],[2,0,2,38],[4,0,4,38],[6,14,6,18],[7,0,8,2],[7,7,7,10],[8,7,8,10],[7,25,8,27],[6,7,6,13],[6,19,6,38],[6,0,6,6],[8,28,8,32],[7,28,7,32],[8,3,8,6],[7,3,7,6],[7,33,7,38],[8,33,8,38],[9,0,9,6],[9,23,9,24],[7,11,7,24],[8,11,8,24],[9,41,9,46],[23,37,23,38],[21,7,21,11],[21,12,21,14],[21,16,21,20],[21,21,21,23],[9,35,9,36],[9,32,9,34],[9,25,9,27],[9,28,9,29],[9,30,9,31],[10,0,11,7],[23,34,23,36],[23,23,23,27],[23,28,25,28],[9,37,9,38],[20,34,20,36],[20,37,20,38],[24,23,25,25],[24,26,25,27],[13,0,13,38],[48,37,48,38],[47,23,48,25],[47,26,48,27],[46,23,46,27],[46,28,48,28],[47,34,47,36],[47,37,47,38],[46,37,46,38],[46,34,46,36],[41,37,41,38],[42,37,42,38],[43,37,43,38],[42,23,42,25],[43,23,43,25],[39,26,39,27],[44,23,44,25],[42,26,42,27],[42,28,42,33],[42,34,42,36],[39,23,39,25],[40,37,40,38],[15,23,15,25],[16,26,16,38],[49,0,49,6],[49,7,49,11],[50,7,50,11],[51,7,51,11],[52,7,52,11],[53,7,53,11],[39,28,39,33],[39,34,39,36],[41,34,41,36],[44,26,44,27],[41,26,41,27],[41,28,41,33],[43,26,43,27],[43,28,43,33],[43,34,43,36],[48,34,48,36],[41,23,41,25],[44,28,44,33],[39,0,40,9],[40,23,40,25],[40,26,40,27],[40,28,40,33],[40,34,40,36],[41,1,44,9],[59,7,59,11],[59,12,59,38],[58,7,58,11],[49,12,49,38],[50,12,50,38],[51,12,51,38],[52,12,52,38],[53,12,53,38],[58,12,58,38],[54,7,54,11],[54,12,54,38],[55,7,55,11],[55,12,55,38],[56,7,56,11],[56,12,56,38],[57,7,57,11],[57,12,57,38]]}
["（様式２）"]
[]
["新型コロナウイルス感染症緊急包括支援交付金（介護分）に関する事業実施計画書（事業所単位）",null,null,null,null,null,null,null,null,null,null,null,null,null,null,null,null,null,null,null,null,null,null,null,null,null,null,null,null,null,null,null,null,null,null,null,null,null,null,null,null,null,null,null,null,null,null,null,null,null,null,null,null,null,null,null,null,null,null,null,null,null,null,null,null,null,null,null,null,null,null,null,null,null,null,null,null,null,null,"（１）①　",null,null,"（２）②"]
[null,null,null,null,null,null,null,null,null,null,null,null,null,null,null,null,null,null,null,null,null,null,null,null,null,null,null,null,null,null,null,null,null,null,null,null,null,null,null,null,null,null,null,null,null,null,null,null,null,null,null,null,null,null,null,null,null,null,null,null,null,null,null,null,null,null,null,null,null,null,null,null,null,null,null,null,null,null,null,"共通",null,"単価","共通"]
["施設概要",null,null,null,null,null,null,null,null,null,null,null,null,null,null,null,null,null,null,null,null,null,null,null,null,null,null,null,null,null,null,null,null,null,null,null,null,null,null,null,null,null,null,null,null,null,null,null,null,null,null,null,null,null,null,null,null,null,null,null,null,null,null,null,null,null,null,null,null,null,null,null,null,null,null,null,null,null,"通所介護事業所（通常規模型）",892,"/事業所",null,200,"/事業所"]
[null,null,null,null,null,null,null,null,null,null,null,null,null,null,null,null,null,null,null,null,null,null,null,null,null,null,null,null,null,null,null,null,null,null,null,null,null,null,null,null,null,null,null,null,null,null,null,null,null,null,null,null,null,null,null,null,null,null,null,null,null,null,null,null,null,null,null,null,null,null,null,null,null,null,null,null,null,null,"通所介護事業所（大規模型（Ⅰ））",1137,"/事業所",null,200,"/事業所"]
["介護保険事業所番号",null,null,null,null,null,null,null,null,null,null,null,null,null,"事業所名称",null,null,null,null,null,null,null,null,null,null,null,null,null,null,null,null,null,null,null,null,null,null,null,null,null,null,null,null,null,null,null,null,null,null,null,null,null,null,null,null,null,null,null,null,null,null,null,null,null,null,null,null,null,null,null,null,null,null,null,null,null,null,null,"通所介護事業所（大規模型（Ⅱ））",1480,"/事業所",null,200,"/事業所"]
["所在地",null,null,"郵便番号",null,null,null,"都道府県名",null,null,null,"住所",null,null,null,null,null,null,null,null,null,null,null,null,null,"連絡先",null,null,"電話番号",null,null,null,null,"担当部署名",null,null,null,null,null,null,null,null,null,null,null,null,null,null,null,null,null,null,null,null,null,null,null,null,null,null,null,null,null,null,null,null,null,null,null,null,null,null,null,null,null,null,null,null,"地域密着型通所介護事業所(療養通所介護事業所を含む)",384,"/事業所",null,200,"/事業所"]
[null,null,null,null,null,null,null,null,null,null,null,null,null,null,null,null,null,null,null,null,null,null,null,null,null,null,null,null,null,null,null,null,null,null,null,null,null,null,null,null,null,null,null,null,null,null,null,null,null,null,null,null,null,null,null,null,null,null,null,null,null,null,null,null,null,null,null,null,null,null,null,null,null,null,null,null,null,null,"認知症対応型通所介護事業所",375,"/事業所",null,200,"/事業所"]
["提供サービス",null,null,null,null,null,null,null,null,null,null,null,null,null,null,null,null,"サービス種類コード",null,null,null,null,null,null,null,"定員",null,null,null,null,"人",null,"職員数\n(派遣含む)",null,null,null,null,"人",null,null,null,null,null,null,null,null,null,null,null,null,null,null,null,null,null,null,null,null,null,null,null,null,null,null,null,null,null,null,null,null,null,null,null,null,null,null,null,null,"通所リハビリテーション事業所（通常規模型）",939,"/事業所",null,200,"/事業所"]
{"$rows_left_out":53}
{"sheet":"職員表","index":5,"n_rows":85,"n_cols":24,"rows_kept":85,"cut":false,"hidden":false,"merged":[[3,21,3,23],[3,15,3,18],[3,19,3,20],[3,0,4,0],[3,6,4,6],[3,7,3,9],[3,14,4,14],[3,1,4,1],[3,2,4,2],[3,3,4,3],[3,10,3,13]]}
["（様式３）介護慰労金受給職員表（法人単位）"]
[]
["※　本表は法人単位でまとめて記載すること。"]
[null,"氏名\n（漢字）","氏名\n（全角カナ）","生年月日\n（西暦）",null,null,"本人の住所","主たる勤務先",null,null,"分類",null,null,null,"慰労金\n(万円)","確認事項",null,null,null,"支払実績",null,"重複ﾁｪｯｸ"]
[null,null,null,null,"（確認用）","（確認用）",null,"事業所番号","サービス種類コード","事業所・施設の名称","施設区分","対応区分","(計算用)","他の施設等との期間通算がある場合その施設名",null,"委任状の有無","他法人での慰労金の申請の有無","業務委託による\n従事者","重複\n申請者確認用","支払年月日\n(西暦)","支払金額\n（円）","氏名","カナ","生年月日"]
[{"$f":"ROW()-5","v":1},null,null,null,{"$f":"B6&C6&D6","v":""},{"$f":"IF(E6=\"\",\"\",COUNTIF($E$6:$E$85,E6))","v":""},null,null,null,null,null,null,{"$f":"K6&L6","v":""},null,{"$f":"IFERROR(VLOOKUP(M6,計算用!$A$8:$B$15,2,FALSE),\"\")","v":""},null,null,null,{"$f":"IF(B6=\"\",\"\",IF(COUNTIF(V6:X6,\">=\"&2),\"！\",\"可\"))","v":""},null,null,{"$f":"IF(B6=\"\",\"\",COUNTIF($B$6:$B85,B6))","v":""},{"$f":"IF(C6=\"\",\"\",COUNTIF($C$6:$C85,C6))","v":""},{"$f":"IF(D6=\"\",\"\",COUNTIF($D$6:$D85,D6))","v":""}]
[{"$f":"ROW()-5","v":2},null,null,null,{"$f":"B7&C7&D7","v":""},{"$f":"IF(E7=\"\",\"\",COUNTIF($E$6:$E$85,E7))","v":""},null,null,null,null,null,null,{"$f":"K7&L7","v":""},null,{"$f":"IFERROR(VLOOKUP(M7,計算用!$A$8:$B$15,2,FALSE),\"\")","v":""},null,null,null,{"$f":"IF(B7=\"\",\"\",IF(COUNTIF(V7:X7,\">=\"&2),\"！\",\"可\"))","v":""},null,null,{"$f":"IF(B7=\"\",\"\",COUNTIF($B$6:$B86,B7))","v":""},{"$f":"IF(C7=\"\",\"\",COUNTIF($C$6:$C86,C7))","v":""},{"$f":"IF(D7=\"\",\"\",COUNTIF($D$6:$D86,D7))","v":""}]
[3,null,null,null,"","",null,null,null,null,null,null,"",null,{"$f":"IFERROR(VLOOKUP(M8,計算用!$A$8:$B$15,2,FALSE),\"\")","v":""},null,null,null,"",null,null,{"$f":"IF(B8=\"\",\"\",COUNTIF($B$6:$B87,B8))","v":""},{"$f":"IF(C8=\"\",\"\",COUNTIF($C$6:$C87,C8))","v":""},{"$f":"IF(D8=\"\",\"\",COUNTIF($D$6:$D87,D8))","v":""}]
[4,null,null,null,"","",null,null,null,null,null,null,"",null,{"$f":"IFERROR(VLOOKUP(M9,計算用!$A$8:$B$15,2,FALSE),\"\")","v":""},null,null,null,"",null,null,{"$f":"IF(B9=\"\",\"\",COUNTIF($B$6:$B88,B9))","v":""},{"$f":"IF(C9=\"\",\"\",COUNTIF($C$6:$C88,C9))","v":""},{"$f":"IF(D9=\"\",\"\",COUNTIF($D$6:$D88,D9))","v":""}]
[5,null,null,null,"","",null,null,null,null,null,null,"",null,{"$f":"IFERROR(VLOOKUP(M10,計算用!$A$8:$B$15,2,FALSE),\"\")","v":""},null,null,null,"",null,null,{"$f":"IF(B10=\"\",\"\",COUNTIF($B$6:$B89,B10))","v":""},{"$f":"IF(C10=\"\",\"\",COUNTIF($C$6:$C89,C10))","v":""},{"$f":"IF(D10=\"\",\"\",COUNTIF($D$6:$D89,D10))","v":""}]
{"$rows_left_out":76}
{"sheet":"口座情報","index":6,"n_rows":104,"n_cols":44,"rows_kept":104,"cut":false,"hidden":false,"merged":[[2,0,3,0],[2,1,3,1],[2,2,3,2],[2,3,3,3],[2,4,2,22],[2,42,2,43],[3,5,3,8],[3,10,3,12],[3,14,3,20],[3,23,3,25],[3,26,3,31],[3,32,3,39],[2,23,2,41]]}
["（様式４）事業所口座情報"]
[]
["No","事業所番号","事業所・施設名","申請額\n（千円）","口座情報（ゆうちょ銀行を除く）",null,null,null,null,null,null,null,null,null,null,null,null,null,null,null,null,null,null,"口座情報（ゆうちょ銀行）",null,null,null,null,null,null,null,null,null,null,null,null,null,null,null,null,null,null,"口座フラグ"]
[null,null,null,null,"金融機関名","金融機関コード",null,null,null,"支店名","支店コード",null,null,"分類","口座番号（右詰めでお書きください）",null,null,null,null,null,null,"口座名義（フリガナ）","口座名義","店番",null,null,"通帳記号\n（6桁目がある場合は※欄に記入下さい",null,null,null,null,null,"口座番号",null,null,null,null,null,null,null,"口座名義（フリガナ）","口座名義","ゆうちょ以外","ゆうちょ"]
[{"$f":"申請額一覧!A5","v":1},{"$f":"IF(申請額一覧!B5=\"\",\"\",申請額一覧!B5)","v":""},{"$f":"IF(申請額一覧!B5=\"\",\"\",申請額一覧!C5)","v":""},{"$f":"IF(申請額一覧!B5=\"\",\"\",申請額一覧!M5)","v":""},null,null,null,null,null,null,null,null,null,null,null,null,null,null,null,null,null,null,null,null,null,null,null,null,null,null,null,null,null,null,null,null,null,null,null,null,null,null,{"$f":"IF(V5=\"\",\"\",1)","v":""},{"$f":"IF(AO5=\"\",\"\",1)","v":""}]
[{"$f":"申請額一覧!A6","v":2},{"$f":"IF(申請額一覧!B6=\"\",\"\",申請額一覧!B6)","v":""},{"$f":"IF(申請額一覧!B6=\"\",\"\",申請額一覧!C6)","v":""},{"$f":"IF(申請額一覧!B6=\"\",\"\",申請額一覧!M6)","v":""},null,null,null,null,null,null,null,null,null,null,null,null,null,null,null,null,null,null,null,null,null,null,null,null,null,null,null,null,null,null,null,null,null,null,null,null,null,null,{"$f":"IF(V6=\"\",\"\",1)","v":""},{"$f":"IF(AO6=\"\",\"\",1)","v":""}]
[{"$f":"申請額一覧!A7","v":3},{"$f":"IF(申請額一覧!B7=\"\",\"\",申請額一覧!B7)","v":""},{"$f":"IF(申請額一覧!B7=\"\",\"\",申請額一覧!C7)","v":""},{"$f":"IF(申請額一覧!B7=\"\",\"\",申請額一覧!M7)","v":""},null,null,null,null,null,null,null,null,null,null,null,null,null,null,null,null,null,null,null,null,null,null,null,null,null,null,null,null,null,null,null,null,null,null,null,null,null,null,"",""]
[{"$f":"申請額一覧!A8","v":4},{"$f":"IF(申請額一覧!B8=\"\",\"\",申請額一覧!B8)","v":""},{"$f":"IF(申請額一覧!B8=\"\",\"\",申請額一覧!C8)","v":""},{"$f":"IF(申請額一覧!B8=\"\",\"\",申請額一覧!M8)","v":""},null,null,null,null,null,null,null,null,null,null,null,null,null,null,null,null,null,null,null,null,null,null,null,null,null,null,null,null,null,null,null,null,null,null,null,null,null,null,"",""]
[{"$f":"申請額一覧!A9","v":5},{"$f":"IF(申請額一覧!B9=\"\",\"\",申請額一覧!B9)","v":""},{"$f":"IF(申請額一覧!B9=\"\",\"\",申請額一覧!C9)","v":""},{"$f":"IF(申請額一覧!B9=\"\",\"\",申請額一覧!M9)","v":""},null,null,null,null,null,null,null,null,null,null,null,null,null,null,null,null,null,null,null,null,null,null,null,null,null,null,null,null,null,null,null,null,null,null,null,null,null,null,"",""]
[{"$f":"申請額一覧!A10","v":6},{"$f":"IF(申請額一覧!B10=\"\",\"\",申請額一覧!B10)","v":""},{"$f":"IF(申請額一覧!B10=\"\",\"\",申請額一覧!C10)","v":""},{"$f":"IF(申請額一覧!B10=\"\",\"\",申請額一覧!M10)","v":""},null,null,null,null,null,null,null,null,null,null,null,null,null,null,null,null,null,null,null,null,null,null,null,null,null,null,null,null,null,null,null,null,null,null,null,null,null,null,"",""]
{"$rows_left_out":95}
{"sheet":"計算用","index":7,"n_rows":67,"n_cols":8,"rows_kept":67,"cut":false,"hidden":true,"merged":[]}
[null,null,null,null,null,null,null,"※本シートは絶対に編集しないこと。"]
["施設区分"]
["陽性者(濃厚接触者)発生施設","通所系･施設系で1日以上勤務又は訪問系で陽性者等に1日以上対応","訪問系で陽性者等への対応はないが対象期間に10日以上勤務","対象期間の勤務が９日以下"]
["その他の施設","対象期間に10日以上勤務","対象期間の勤務が9日以下"]
[]
[]
["慰労金単価"]
[{"$f":"A3&B3","v":"陽性者(濃厚接触者)発生施設通所系･施設系で1日以上勤務又は訪問系で陽性者等に1日以上対応"},20]
[{"$f":"A3&C3","v":"陽性者(濃厚接触者)発生施設訪問系で陽性者等への対応はないが対象期間に10日以上勤務"},5]
[{"$f":"A3&D3","v":"陽性者(濃厚接触者)発生施設対象期間の勤務が９日以下"},0]
{"$rows_left_out":57}